{"text_format":"1","workbook":"xlsx","n_sheets":8,"sheets":["Introduction","FundIDs","Suggested Guidance","Fee Template","FeeTransparencyFundNAV-3.0.1","FeeTransparencyFundSch...-3.0.1","Definitions","Related Party Definition"],"not_rendered":{"charts":0,"images":2,"macros":0,"external_links":2,"defined_names":17,"comments":2,"pivot_tables":0},"unopened":[],"bounds":{"document_bytes":16777216,"sheet_cells":100000,"rows_first":2000,"rows_last":500,"rows_between":2000,"halvings":0,"cell_chars":16384,"cell_head_chars":4096},"cells_cut":0,"cells_raw":0,"read":"whole","date_system":"1900"}

{"sheet":"Introduction","index":0,"n_rows":29,"n_cols":4,"rows_kept":29,"cut":false,"hidden":false,"merged":[[21,2,21,10],[23,2,23,10],[24,2,24,10],[9,2,9,10],[8,2,8,10],[10,2,10,10],[11,2,12,10],[15,2,15,10],[17,2,17,10],[19,2,19,10]]}
[]
[]
[]
[]
[]
[]
[]
[]
{"$rows_left_out":22}
{"sheet":"FundIDs","index":1,"n_rows":11,"n_cols":3,"rows_kept":11,"cut":false,"hidden":false,"merged":[]}
[]
[null,"Please use the AltExchange Validation server to obtain unique Fund and Company identifiers."]
[null,"Please note that AltExchange definitions include the possibility to include a Master Fund and  a fund."]
[null,"The Parent Fund is the Top level fund name or grouping (ie Atlantic 3 consists of Atlantic 3 AIV 1, Blocker 2 etc\nThis maps to the Name Server Fund Name (Legal Entity)"]
[null,"The Fund identifies the entity for the amounts reported in the domain. FundName can be the same as Master Fund or be a component of it). \nThis maps to the Name Server Fund Name (Legal Entity)"]
[null,"For additional information  on the name server, please refer to the relevant documentation on the AltExchange Validation Platform website:"]
[null,"www.altexchangevp.com"]
[]
{"$rows_left_out":4}
{"sheet":"Suggested Guidance","index":2,"n_rows":120,"n_cols":2,"rows_kept":120,"cut":false,"hidden":false,"merged":[]}
[]
[null,"Overview"]
[]
[null,"The ILPA Fee Reporting Template (the “Template”) was developed to promote more uniform reporting practices in the private equity industry. It is one component of the ILPA's Fee Transparency Initiative (the “Initiative”), a broad-based effort to establish more robust and consistent standards for fee reporting and compliance among investors, fund managers and their advisors. The Initiative is comprised of senior investment and reporting professionals from a cross-section of investor institutions and advisors. "]
[null,"The Template (version 1.0), which details all monies paid to the fund manager, affiliates and third parties, is the first deliverable of the Initiative. The Template reflects feedback from more than 120 individuals and organizations, including nearly 50 global LP groups, and 25 General Partner organizations (GPs), as well as numerous industry trade bodies and a number of leading consultants, advisors, fund administrators and accountants."]
[]
[null,"Template Goals"]
[]
{"$rows_left_out":113}
{"sheet":"Fee Template","index":3,"n_rows":108,"n_cols":16,"rows_kept":108,"cut":false,"hidden":false,"merged":[[108,1,108,12],[109,1,109,12],[110,1,110,12],[111,1,111,12],[57,1,61,1],[61,2,61,3],[101,1,101,12],[102,1,102,12],[103,1,103,12],[104,1,104,2],[106,1,106,12],[107,1,107,12],[94,2,94,3],[95,2,95,3],[96,1,96,3],[98,1,98,12],[99,1,99,12],[100,1,100,12],[85,2,85,3],[86,2,86,3],[87,2,87,3],[88,2,88,3],[89,2,89,3],[90,2,90,3],[91,2,91,3],[92,2,92,3],[93,2,93,3],[79,13,80,13],[81,1,81,3],[81,4,81,6],[81,7,81,9],[81,10,81,12],[82,1,86,1],[82,2,82,3],[82,10,86,12],[83,2,83,3],[84,2,84,3],[87,1,95,1],[75,1,75,3],[76,1,76,3],[76,10,78,12],[77,1,77,3],[78,1,78,3],[79,1,80,12],[72,1,72,3],[72,4,72,6],[72,7,72,9],[72,10,72,12],[73,1,73,3],[74,1,74,3],[65,1,65,3],[66,1,66,3],[67,1,67,3],[68,1,68,3],[69,1,69,3],[70,1,70,3],[63,1,63,3],[63,4,63,6],[63,7,63,9],[63,10,63,12],[64,1,64,3],[52,1,52,3],[53,1,53,3],[54,1,54,3],[55,1,55,3],[56,1,56,3],[57,2,57,3],[58,2,58,3],[59,2,59,3],[60,2,60,3],[46,1,46,3],[47,1,47,3],[48,1,48,3],[49,1,49,3],[50,1,50,3],[51,1,51,3],[37,1,37,2],[38,1,38,2],[39,1,39,2],[40,1,40,2],[41,1,41,2],[42,1,45,1],[42,2,42,3],[43,2,43,3],[44,2,44,3],[45,2,45,3],[32,1,32,2],[32,10,32,12],[33,1,33,2],[34,1,34,2],[35,1,35,2],[36,1,36,2],[26,1,26,3],[27,1,27,3],[28,1,28,3],[29,1,29,3],[30,1,30,3],[31,1,31,3],[22,1,22,3],[23,1,23,3],[24,1,24,3],[25,1,25,3],[14,1,14,3],[15,1,15,3],[16,1,16,3],[17,1,17,3],[18,1,18,3],[19,1,19,3],[7,1,7,12],[8,1,10,3],[12,1,12,12],[13,1,13,3],[13,4,13,6],[13,7,13,9],[13,10,13,12],[20,1,20,3],[21,1,21,3],[18,4,18,6],[18,7,18,9],[18,10,18,12]]}
[null,"Master Fund Name","Best Practices Fund II, L.P. Master"]
[null,"Master Fund Currency","USD"]
[null,"Master Fund Size",3000000000]
[null,"Fund Name",{"$f":"B9","v":"Best Practices Fund II, L.P."}]
[null,"Fund Currency","USD"]
[null,"Investor Name","LP #5"]
[]
[null,"ILPA Fee Reporting Template (v. 1.0) - This packet was last updated on January 28, 2016",null,null,null,null,null,null,null,null,null,null,null,null,"Inception Start:","2007-02-25"]
{"$rows_left_out":101}
{"sheet":"FeeTransparencyFundNAV-3.0.1","index":4,"n_rows":18,"n_cols":217,"rows_kept":18,"cut":false,"hidden":false,"merged":[]}
[null,"Domain","Version","Level"]
[null,"FeeTransparencyFundNAV","3.0",1]
[]
["*","FeeTransparencyFundNAV"]
[null,"ReportingDate","Description (optional)","CurrencyCode","Fund.MasterFund","Fund.MasterFundUID","Fund.MasterFundSize","Fund.FundName","Fund.FundUID","Fund.FundSize"]
[null,{"$f":"'Fee Template'!P11","v":"2015-12-31"},null,{"$f":"'Fee Template'!C2","v":"USD"},{"$f":"'Fee Template'!C1","v":"Best Practices Fund II, L.P. Master"},{"$f":"VLOOKUP(E6,FundIDs!$B$10:$C$109,2,FALSE)","v":"FUND000000111051735"},{"$f":"'Fee Template'!C3","v":3000000000},{"$f":"'Fee Template'!C4","v":"Best Practices Fund II, L.P."},{"$f":"VLOOKUP(H6,FundIDs!$B$10:$C$109,2,FALSE)","v":"FUND000000111051735"},{"$f":"'Fee Template'!J65","v":2503750000}]
[]
[]
{"$rows_left_out":11}
{"sheet":"FeeTransparencyFundSch...-3.0.1","index":5,"n_rows":18,"n_cols":56,"rows_kept":18,"cut":false,"hidden":false,"merged":[]}
[null,"Domain","Version","Level"]
[null,"FeeTransparencyFundSchedule","3.0",1]
[]
["*","FeeTransparencyFundSchedule"]
[null,"ReportingDate","Description (optional)","CurrencyCode","Fund.MasterFund","Fund.MasterFundUID","Fund.MasterFundSize","Fund.FundName","Fund.FundUID","Fund.FundSize"]
[null,{"$f":"'Fee Template'!P11","v":"2015-12-31"},null,{"$f":"'Fee Template'!C2","v":"USD"},{"$f":"'Fee Template'!C1","v":"Best Practices Fund II, L.P. Master"},{"$f":"VLOOKUP(E6,FundIDs!$B$10:$C$109,2,FALSE)","v":"FUND000000111051735"},{"$f":"'Fee Template'!C3","v":3000000000},{"$f":"'Fee Template'!C4","v":"Best Practices Fund II, L.P."},{"$f":"VLOOKUP(H6,FundIDs!$B$10:$C$109,2,FALSE)","v":"FUND000000111051735"},{"$f":"'Fee Template'!J65","v":2503750000}]
[]
[]
{"$rows_left_out":11}
{"sheet":"Definitions","index":6,"n_rows":57,"n_cols":5,"rows_kept":57,"cut":false,"hidden":false,"merged":[[2,1,35,1],[36,1,41,1],[42,1,55,1]]}
[]
[null,"Section","Field","Definition","x"]
[null,"A1. NAV Reconciliation","LP's Allocation of Total Fund","Balances that represent a single LP's interest in the Total Fund; Estimations are acceptable for any single LP amount that's denoted with a \"****\"","x"]
[null,null,"Total Fund (incl. GP Allocation)","Balances that represent the cumulative interest of a single fund, including all of its side/parallel vehicles (current and liquidated)","x"]
[null,null,"GP's Allocation of Total Fund","Balances that represent the interest of the legal entity, including any Related Parties, that manages the fund","x"]
[null,null,"Non-Cash Contributions & Distributions","Includes any in-kind transactions (e.g. stock distributions) and/or \"net-zero\" transactions (i.e. call and distribution for the exact same amount on the same date)","x"]
[null,null,"Management Fee Rebate","Refund of any prior management fees to the Fund's investors","x"]
[null,null,"Partnership Expenses – Accounting, Administration & IT","Expenses charged to the Fund for fund administration, including accounting, valuation services, filing fees and IT activities; Any YTD expenses attributed to internal staff, Related Parties and/or internal infrastructure must be footnoted in this document; Excludes expenses for audit and tax preparation","x"]
{"$rows_left_out":50}
{"sheet":"Related Party Definition","index":7,"n_rows":8,"n_cols":2,"rows_kept":8,"cut":false,"hidden":false,"merged":[[5,1,5,3],[30,2,30,3],[31,2,31,3],[32,2,32,3],[21,2,21,3],[22,2,22,3],[23,2,23,3],[24,2,24,3],[25,2,25,3],[26,2,26,3],[7,1,7,3],[3,1,4,3],[6,1,6,3],[27,2,27,3],[28,2,28,3],[29,2,29,3],[15,2,15,3],[16,2,16,3],[17,2,17,3],[18,2,18,3],[19,2,19,3],[20,2,20,3],[10,2,10,3],[11,2,11,3],[12,2,12,3],[13,2,13,3],[14,2,14,3],[33,2,33,3],[34,2,34,3],[35,2,35,3],[36,2,36,3],[37,2,37,3]]}
[]
[]
[]
[null,"The ILPA acknowledges that the definition of ‘Related Parties’ can vary from manager to manager, and is typically linked to specific language in a fund’s LPA.  The ILPA also acknowledges that it’s unlikely a manager would track and report Related Party activities that did not fall within the scope of any previously agreed upon definition.  However, to ensure that a consistent standard is applied to any future funds, the ILPA strongly recommends the use of the following Related Party definition in any disclosures for funds with an inception date after March 1, 2016:"]
[]
[]
[null,"Operational Person(s) means any operational partner, senior advisor or other consultant or employee whose primary activity for a Relevant Entity is to provide operational or back office support to any portfolio company of any investment vehicle, account or fund managed by a Related Person. \n\nRelated Person(s) means any current or former employee, manager or partner of any Relevant Entity which employee, manager or partner is involved in the investment activities or accounting and valuation functions of such Relevant Entity or any of their respective family members.\n\nRelated Party(ies) means (i) any Related Person, (ii) any Operational Person, (iii) any entity more than [10]% of the ownership of which is held directly or indirectly (whether through other entities or trusts) by any Related Person or Operational Person and whether or not such Related Person or Operational Person participates in the carried interest received by the General Partner or the Special Limited Partner, and (iv) any consulting, legal or other service provider regularly engaged by portfolio companies of any investment vehicle, account or fund managed by a Related Person and which also provides advice or services to any Related Person or Relevant Entity.   \n\nRelevant Entity(ies) means the General Partner, any separate carry vehicle, the Investor Advisor or any of their parent or subsidiary entities or any similar entity related to any other investment vehicle, account or fund advised or managed by any current or former Related Person."]
[null,{"$f":"'Fee Template'!B8","v":"ILPA Fee Reporting Template (v. 1.0) - This packet was last updated on January 28, 2016"}]